Reaction Details
TargetSerine-protein kinase ATM
LigandBDBM50156495
Substrate/Competitorn/a
Meas. Tech.ChEMBL_305814 (CHEMBL829467)
IC50>100000±n/a nM
Citation Leahy, JJGolding, BTGriffin, RJHardcastle, IRRichardson, CRigoreau, LSmith, GC Identification of a highly potent and selective DNA-dependent protein kinase (DNA-PK) inhibitor (NU7441) by screening of chromenone libraries. Bioorg Med Chem Lett14:6083-7 (2004) 
 
Serine-protein kinase ATM
Name:Serine-protein kinase ATM
Type:Protein
Mol. Mass.:350696.72
Organism:Homo sapiens (Human)
Description:Q13315
Residue:3056
BDBM50156495
NameBDBM50156495
Synonyms:8-(dibenzo[b,d]thiophen-4-yl)-2-morpholino-4H-chromen-4-one 8-dibenzothiophen-1-yl-2-morpholin-4-yl-chromen-4-one NU-7432 | NU-7441
TypeSmall organic molecule
Emp. Form.C25H19NO3S
Mol. Mass.413.488
SMILESO=c1cc(oc2c(cccc12)-c1cccc2c3ccccc3sc12)N1CCOCC1