Reaction Details
TargetReverse transcriptase/RNaseH
LigandBDBM2951
Substrate/Competitorn/a
Meas. Tech.ChEMBL_305433 (CHEMBL830926)
IC50 608±n/a nM
Citation Balaji, SKarthikeyan, CMoorthy, NSTrivedi, P QSAR modelling of HIV-1 reverse transcriptase inhibition by benzoxazinones using a combination of P_VSA and pharmacophore feature descriptors. Bioorg Med Chem Lett14:6089-94 (2004) 
 
Reverse transcriptase/RNaseH
Name:Reverse transcriptase/RNaseH
Type:PROTEIN
Mol. Mass.:65229.15
Organism:Human immunodeficiency virus 1
Description:ChEMBL_1473730
Residue:566
BDBM2951
NameBDBM2951
Synonyms:4-(2-cyclopropylethynyl)-6-(methylamino)-4-(trifluoromethyl)-2,4-dihydro-1H-3,1-benzoxazin-2-one CHEMBL322813
TypeSmall organic molecule
Emp. Form.C15H13F3N2O2
Mol. Mass.310.2711
SMILESCNc1ccc2NC(=O)OC(C#CC3CC3)(c2c1)C(F)(F)F