Reaction Details
TargetAndrogen receptor
LigandBDBM50156509
Substrate/Competitorn/a
Meas. Tech.ChEMBL_303250 (CHEMBL826376)
Ki 120±n/a nM
Citation Balog, ASalvati, MEShan, WMathur, ALeith, LWWei, DDAttar, RMGeng, JRizzo, CAWang, CKrystek, SRTokarski, JSHunt, JTGottardis, MWeinmann, R The synthesis and evaluation of [2.2.1]-bicycloazahydantoins as androgen receptor antagonists. Bioorg Med Chem Lett14:6107-11 (2004) 
 
Androgen receptor
Name:Androgen receptor
Type:Receptor
Mol. Mass.:99185.27
Organism:Homo sapiens (Human)
Description:CHO cells were stably transfected with human AR gene.
Residue:920
BDBM50156509
NameBDBM50156509
Synonyms:4-((1S,6R,7S)-8-Benzoyl-3,5-dioxo-2,4,8-triaza-tricyclo[5.2.1.0*2,6*]dec-4-yl)-2-trifluoromethyl-benzonitrile | CHEMBL189600
TypeSmall organic molecule
Emp. Form.C22H15F3N4O3
Mol. Mass.440.3747
SMILESOc1c2[C@@H]3C[C@@H](CN3C(=O)c3ccccc3)n2c(=O)n1-c1ccc(C#N)c(c1)C(F)(F)F