Reaction Details
TargetAndrogen receptor
LigandBDBM50156517
Substrate/Competitorn/a
Meas. Tech.ChEMBL_312372 (CHEMBL836730)
IC50 780.0±n/a nM
Citation Balog, ASalvati, MEShan, WMathur, ALeith, LWWei, DDAttar, RMGeng, JRizzo, CAWang, CKrystek, SRTokarski, JSHunt, JTGottardis, MWeinmann, R The synthesis and evaluation of [2.2.1]-bicycloazahydantoins as androgen receptor antagonists. Bioorg Med Chem Lett14:6107-11 (2004) 
 
Androgen receptor
Name:Androgen receptor
Type:Receptor
Mol. Mass.:99185.27
Organism:Homo sapiens (Human)
Description:CHO cells were stably transfected with human AR gene.
Residue:920
BDBM50156517
NameBDBM50156517
Synonyms:(1S,6R,7S)-4-(4-Cyano-3-trifluoromethyl-phenyl)-6-methyl-3,5-dioxo-2,4,8-triaza-tricyclo[5.2.1.0*2,6*]decane-8-carboxylic acid tert-butyl ester | CHEMBL188261
TypeSmall organic molecule
Emp. Form.C21H21F3N4O4
Mol. Mass.450.411
SMILESCC(C)(C)OC(=O)N1C[C@@H]2C[C@H]1[C@@]1(C)N2C(=O)N(C1=O)c1ccc(C#N)c(c1)C(F)(F)F