Reaction Details
TargetAndrogen receptor
LigandBDBM50156513
Substrate/Competitorn/a
Meas. Tech.ChEMBL_303250 (CHEMBL826376)
Ki 10±n/a nM
Citation Balog, ASalvati, MEShan, WMathur, ALeith, LWWei, DDAttar, RMGeng, JRizzo, CAWang, CKrystek, SRTokarski, JSHunt, JTGottardis, MWeinmann, R The synthesis and evaluation of [2.2.1]-bicycloazahydantoins as androgen receptor antagonists. Bioorg Med Chem Lett14:6107-11 (2004) 
 
Androgen receptor
Name:Androgen receptor
Type:Receptor
Mol. Mass.:99185.27
Organism:Homo sapiens (Human)
Description:CHO cells were stably transfected with human AR gene.
Residue:920
BDBM50156513
NameBDBM50156513
Synonyms:(1S,6R,7S)-4-(4-Nitro-naphthalen-1-yl)-3,5-dioxo-2,4,8-triaza-tricyclo[5.2.1.0*2,6*]decane-8-carboxylic acid 4-fluoro-phenyl ester | CHEMBL426623
TypeSmall organic molecule
Emp. Form.C24H17FN4O6
Mol. Mass.476.4134
SMILESOc1c2[C@@H]3C[C@@H](CN3C(=O)Oc3ccc(F)cc3)n2c(=O)n1-c1ccc([N+]([O-])=O)c2ccccc12