Reaction Details
TargetProstaglandin E2 receptor EP4 subtype
LigandBDBM50156548
Substrate/Competitorn/a
Meas. Tech.ChEMBL_429536 (CHEMBL918077)
Ki 6.9±n/a nM
Citation Elworthy, TRBrill, ERChiou, SSChu, FHarris, JRHendricks, RTHuang, JKim, WLach, LKMirzadegan, TYee, CWalker, KA Lactams as EP4 prostanoid receptor agonists. 3. Discovery of N-ethylbenzoic acid 2-pyrrolidinones as subtype selective agents. J Med Chem47:6124-7 (2004) 
 
Prostaglandin E2 receptor EP4 subtype
Name:Prostaglandin E2 receptor EP4 subtype
Type:Enzyme
Mol. Mass.:53134.53
Organism:Homo sapiens (Human)
Description:P35408
Residue:488
BDBM50156548
NameBDBM50156548
Synonyms:5-(2-((R)-2-((S,E)-3-hydroxyoct-1-enyl)-5-oxopyrrolidin-1-yl)ethyl)thiophene-2-carboxylic acid | CHEMBL224970
TypeSmall organic molecule
Emp. Form.C19H27NO4S
Mol. Mass.365.487
SMILESCCCCC[C@H](O)\C=C\[C@H]1CCC(=O)N1CCc1ccc(s1)C(O)=O