Reaction Details
TargetProstaglandin G/H synthase 1
LigandBDBM50156581
Substrate/Competitorn/a
Meas. Tech.ChEMBL_429561 (CHEMBL919559)
IC50 36±n/a nM
Citation Pommery, NTaverne, TTelliez, AGoossens, LCharlier, CPommery, JGoossens, JFHoussin, RDurant, FHénichart, JP New COX-2/5-LOX inhibitors: apoptosis-inducing agents potentially useful in prostate cancer chemotherapy. J Med Chem47:6195-206 (2004) 
 
Prostaglandin G/H synthase 1
Name:Prostaglandin G/H synthase 1
Type:Enzyme
Mol. Mass.:68692.62
Organism:Homo sapiens (Human)
Description:P23219
Residue:599
BDBM50156581
NameBDBM50156581
Synonyms:3-[3-fluoro-5-(4-methoxytetrahydropyran-4-yl)phenoxymethyl]-1-(4-methoxyphenyl)-5-phenyl-1H-pyrazole | CHEMBL222480
TypeSmall organic molecule
Emp. Form.C29H29FN2O4
Mol. Mass.488.55
SMILESCOc1ccc(cc1)-n1nc(COc2cc(F)cc(c2)C2(CCOCC2)OC)cc1-c1ccccc1