Reaction Details
TargetPolyunsaturated fatty acid 5-lipoxygenase
LigandBDBM50156585
Substrate/Competitorn/a
Meas. Tech.ChEMBL_429564 (CHEMBL919562)
IC50 480±n/a nM
Citation Pommery, NTaverne, TTelliez, AGoossens, LCharlier, CPommery, JGoossens, JFHoussin, RDurant, FHénichart, JP New COX-2/5-LOX inhibitors: apoptosis-inducing agents potentially useful in prostate cancer chemotherapy. J Med Chem47:6195-206 (2004) 
 
Polyunsaturated fatty acid 5-lipoxygenase
Name:Polyunsaturated fatty acid 5-lipoxygenase
Type:Enzyme
Mol. Mass.:77972.74
Organism:Homo sapiens (Human)
Description:Recombinant protein was purified from E. coli lysate. After ammonium sulfate precipitation and subsequent steps, the supernatant (S100) was used for 5-LO activity assay.
Residue:674
BDBM50156585
NameBDBM50156585
Synonyms:3-[3-fluoro-5-(4-methoxytetrahydropyran-4-yl)phenoxymethyl]-1-(4-fluorophenyl)-5-phenyl-1H-pyrazole | CHEMBL375308
TypeSmall organic molecule
Emp. Form.C28H26F2N2O3
Mol. Mass.476.5144
SMILESCOC1(CCOCC1)c1cc(F)cc(OCc2cc(-c3ccccc3)n(n2)-c2ccc(F)cc2)c1