Reaction Details
TargetProstaglandin G/H synthase 2
LigandBDBM50156581
Substrate/Competitorn/a
Meas. Tech.ChEMBL_429562 (CHEMBL919560)
IC50 300±n/a nM
Citation Pommery, NTaverne, TTelliez, AGoossens, LCharlier, CPommery, JGoossens, JFHoussin, RDurant, FHénichart, JP New COX-2/5-LOX inhibitors: apoptosis-inducing agents potentially useful in prostate cancer chemotherapy. J Med Chem47:6195-206 (2004) 
 
Prostaglandin G/H synthase 2
Name:Prostaglandin G/H synthase 2
Type:Enzyme
Mol. Mass.:69003.89
Organism:Homo sapiens (Human)
Description:Recombinant Cox-2 provided by Cayman (Cayman Chemical Co.,Ann Arbor, MI).
Residue:604
BDBM50156581
NameBDBM50156581
Synonyms:3-[3-fluoro-5-(4-methoxytetrahydropyran-4-yl)phenoxymethyl]-1-(4-methoxyphenyl)-5-phenyl-1H-pyrazole | CHEMBL222480
TypeSmall organic molecule
Emp. Form.C29H29FN2O4
Mol. Mass.488.55
SMILESCOc1ccc(cc1)-n1nc(COc2cc(F)cc(c2)C2(CCOCC2)OC)cc1-c1ccccc1