Reaction Details
TargetMitogen-activated protein kinase 14
LigandBDBM50156747
Substrate/Competitorn/a
Meas. Tech.ChEMBL_429695 (CHEMBL904269)
IC50 73±n/a nM
Citation Leftheris, KAhmed, GChan, RDyckman, AJHussain, ZHo, KHynes, JLetourneau, JLi, WLin, SMetzger, AMoriarty, KJRiviello, CShimshock, YWen, JWityak, JWrobleski, STWu, HWu, JDesai, MGillooly, KMLin, THLoo, DMcIntyre, KWPitt, SShen, DRShuster, DJZhang, RDiller, DDoweyko, ASack, JBaldwin, JBarrish, JDodd, JHenderson, IKanner, SSchieven, GLWebb, M The discovery of orally active triaminotriazine aniline amides as inhibitors of p38 MAP kinase. J Med Chem47:6283-91 (2004) 
 
Mitogen-activated protein kinase 14
Name:Mitogen-activated protein kinase 14
Type:Serine/threonine-protein kinase
Mol. Mass.:41286.76
Organism:Homo sapiens (Human)
Description:Q16539
Residue:360
BDBM50156747
NameBDBM50156747
Synonyms:(S)-3-(4-(isobutylamino)-6-(pyrrolidin-3-ylamino)-1,3,5-triazin-2-ylamino)-4-methylbenzamide | CHEMBL413783
TypeSmall organic molecule
Emp. Form.C19H28N8O
Mol. Mass.384.4786
SMILESCC(C)CNc1nc(N[C@H]2CCNC2)nc(Nc2cc(ccc2C)C(N)=O)n1