Reaction Details
TargetMitogen-activated protein kinase 14
LigandBDBM50156754
Substrate/Competitorn/a
Meas. Tech.ChEMBL_429695 (CHEMBL904269)
IC50 8±n/a nM
Citation Leftheris, KAhmed, GChan, RDyckman, AJHussain, ZHo, KHynes, JLetourneau, JLi, WLin, SMetzger, AMoriarty, KJRiviello, CShimshock, YWen, JWityak, JWrobleski, STWu, HWu, JDesai, MGillooly, KMLin, THLoo, DMcIntyre, KWPitt, SShen, DRShuster, DJZhang, RDiller, DDoweyko, ASack, JBaldwin, JBarrish, JDodd, JHenderson, IKanner, SSchieven, GLWebb, M The discovery of orally active triaminotriazine aniline amides as inhibitors of p38 MAP kinase. J Med Chem47:6283-91 (2004) 
 
Mitogen-activated protein kinase 14
Name:Mitogen-activated protein kinase 14
Type:Serine/threonine-protein kinase
Mol. Mass.:41286.76
Organism:Homo sapiens (Human)
Description:Q16539
Residue:360
BDBM50156754
NameBDBM50156754
Synonyms:(S)-N-methoxy-4-methyl-3-(4-(methyl(neopentyl)amino)-6-(pyrrolidin-3-ylamino)-1,3,5-triazin-2-ylamino)benzamide | CHEMBL225418
TypeSmall organic molecule
Emp. Form.C22H34N8O2
Mol. Mass.442.5578
SMILESCONC(=O)c1ccc(C)c(Nc2nc(N[C@H]3CCNC3)nc(n2)N(C)CC(C)(C)C)c1