Reaction Details
TargetTyrosine-protein kinase JAK3
LigandBDBM16316
Substrate/Competitorn/a
Meas. Tech.ChEMBL_429707 (CHEMBL904281)
IC50>10000±n/a nM
Citation Leftheris, KAhmed, GChan, RDyckman, AJHussain, ZHo, KHynes, JLetourneau, JLi, WLin, SMetzger, AMoriarty, KJRiviello, CShimshock, YWen, JWityak, JWrobleski, STWu, HWu, JDesai, MGillooly, KMLin, THLoo, DMcIntyre, KWPitt, SShen, DRShuster, DJZhang, RDiller, DDoweyko, ASack, JBaldwin, JBarrish, JDodd, JHenderson, IKanner, SSchieven, GLWebb, M The discovery of orally active triaminotriazine aniline amides as inhibitors of p38 MAP kinase. J Med Chem47:6283-91 (2004) 
 
Tyrosine-protein kinase JAK3
Name:Tyrosine-protein kinase JAK3
Type:Protein
Mol. Mass.:125111.08
Organism:Homo sapiens (Human)
Description:P52333
Residue:1124
BDBM16316
NameBDBM16316
Synonyms:3-({4-[(2,2-dimethylpropyl)(methyl)amino]-6-(4-methyl-1,4-diazepan-1-yl)-1,3,5-triazin-2-yl}amino)-N-methoxy-4-methylbenzamide triaminotriazine aniline amide inhibitor, 1
TypeSmall organic molecule
Emp. Form.C24H38N8O2
Mol. Mass.470.6109
SMILESCONC(=O)c1ccc(C)c(Nc2nc(nc(n2)N2CCCN(C)CC2)N(C)CC(C)(C)C)c1