Reaction Details
TargetHistamine H2 receptor
LigandBDBM50156859
Substrate/Competitorn/a
Meas. Tech.ChEMBL_429753 (CHEMBL914453)
IC50 1500±n/a nM
Citation Fonquerna, SMiralpeix, MPagès, LPuig, CCardús, AAntón, FCárdenas, AVilella, DAparici, MCalaf, EPrieto, JGras, JHuerta, JMWarrellow, GBeleta, JRyder, H Synthesis and structure-activity relationships of novel histamine H1 antagonists: indolylpiperidinyl benzoic acid derivatives. J Med Chem47:6326-37 (2004) 
 
Histamine H2 receptor
Name:Histamine H2 receptor
Type:G Protein-Coupled Receptor (GPCR)
Mol. Mass.:40115.31
Organism:Homo sapiens (Human)
Description:n/a
Residue:359
BDBM50156859
NameBDBM50156859
Synonyms:2-(2-(4-(5-bromo-1-(2-ethoxyethyl)-1H-indol-3-yl)piperidin-1-yl)ethoxy)benzoic acid | CHEMBL387390
TypeSmall organic molecule
Emp. Form.C26H31BrN2O4
Mol. Mass.515.439
SMILESCCOCCn1cc(C2CCN(CCOc3ccccc3C(O)=O)CC2)c2cc(Br)ccc12