Reaction Details
TargetHistamine H1 receptor
LigandBDBM50156858
Substrate/Competitorn/a
Meas. Tech.ChEMBL_429751 (CHEMBL914451)
IC50 150±n/a nM
Citation Fonquerna, SMiralpeix, MPagès, LPuig, CCardús, AAntón, FCárdenas, AVilella, DAparici, MCalaf, EPrieto, JGras, JHuerta, JMWarrellow, GBeleta, JRyder, H Synthesis and structure-activity relationships of novel histamine H1 antagonists: indolylpiperidinyl benzoic acid derivatives. J Med Chem47:6326-37 (2004) 
 
Histamine H1 receptor
Name:Histamine H1 receptor
Type:G Protein-Coupled Receptor (GPCR)
Mol. Mass.:55641.53
Organism:Cavia porcellus (domestic guinea pig)
Description:Guinea pig cerebellum was used in binding assay.
Residue:488
BDBM50156858
NameBDBM50156858
Synonyms:3-{4-[6-fluoro-1-(2-methoxyethyl)-1H-indol-3-yl]piperidin-1-ylmethyl}benzoic acid | CHEMBL222142
TypeSmall organic molecule
Emp. Form.C24H27FN2O3
Mol. Mass.410.4812
SMILESCOCCn1cc(C2CCN(Cc3cccc(c3)C(O)=O)CC2)c2ccc(F)cc12