Reaction Details
TargetHistamine H2 receptor
LigandBDBM50156889
Substrate/Competitorn/a
Meas. Tech.ChEMBL_429753 (CHEMBL914453)
IC50 5600±n/a nM
Citation Fonquerna, SMiralpeix, MPagès, LPuig, CCardús, AAntón, FCárdenas, AVilella, DAparici, MCalaf, EPrieto, JGras, JHuerta, JMWarrellow, GBeleta, JRyder, H Synthesis and structure-activity relationships of novel histamine H1 antagonists: indolylpiperidinyl benzoic acid derivatives. J Med Chem47:6326-37 (2004) 
 
Histamine H2 receptor
Name:Histamine H2 receptor
Type:G Protein-Coupled Receptor (GPCR)
Mol. Mass.:40115.31
Organism:Homo sapiens (Human)
Description:n/a
Residue:359
BDBM50156889
NameBDBM50156889
Synonyms:5-{4-[1-(2-ethoxyethyl)-1H-indol-3-yl]piperidin-1-ylmethyl}-2-fluorobenzoic acid | CHEMBL374059
TypeSmall organic molecule
Emp. Form.C25H29FN2O3
Mol. Mass.424.5078
SMILESCCOCCn1cc(C2CCN(Cc3ccc(F)c(c3)C(O)=O)CC2)c2ccccc12