Reaction Details
TargetHistamine H1 receptor
LigandBDBM50156884
Substrate/Competitorn/a
Meas. Tech.ChEMBL_429751 (CHEMBL914451)
IC50 90±n/a nM
Citation Fonquerna, SMiralpeix, MPagès, LPuig, CCardús, AAntón, FCárdenas, AVilella, DAparici, MCalaf, EPrieto, JGras, JHuerta, JMWarrellow, GBeleta, JRyder, H Synthesis and structure-activity relationships of novel histamine H1 antagonists: indolylpiperidinyl benzoic acid derivatives. J Med Chem47:6326-37 (2004) 
 
Histamine H1 receptor
Name:Histamine H1 receptor
Type:G Protein-Coupled Receptor (GPCR)
Mol. Mass.:55641.53
Organism:Cavia porcellus (domestic guinea pig)
Description:Guinea pig cerebellum was used in binding assay.
Residue:488
BDBM50156884
NameBDBM50156884
Synonyms:3-[4-(1-thiophen-2-ylmethyl-1H-indol-3-yl)piperidin-1-ylmethyl]benzoic acid | CHEMBL222372
TypeSmall organic molecule
Emp. Form.C26H26N2O2S
Mol. Mass.430.562
SMILESOC(=O)c1cccc(CN2CCC(CC2)c2cn(Cc3cccs3)c3ccccc23)c1