Reaction Details
TargetHistamine H1 receptor
LigandBDBM50156875
Substrate/Competitorn/a
Meas. Tech.ChEMBL_429751 (CHEMBL914451)
IC50 500±n/a nM
Citation Fonquerna, SMiralpeix, MPagès, LPuig, CCardús, AAntón, FCárdenas, AVilella, DAparici, MCalaf, EPrieto, JGras, JHuerta, JMWarrellow, GBeleta, JRyder, H Synthesis and structure-activity relationships of novel histamine H1 antagonists: indolylpiperidinyl benzoic acid derivatives. J Med Chem47:6326-37 (2004) 
 
Histamine H1 receptor
Name:Histamine H1 receptor
Type:G Protein-Coupled Receptor (GPCR)
Mol. Mass.:55641.53
Organism:Cavia porcellus (domestic guinea pig)
Description:Guinea pig cerebellum was used in binding assay.
Residue:488
BDBM50156875
NameBDBM50156875
Synonyms:2-(2-(4-(1-(2-ethoxyethyl)-1H-indol-3-yl)piperidin-1-yl)ethoxy)-6-fluorobenzoic acid | CHEMBL376025
TypeSmall organic molecule
Emp. Form.C26H31FN2O4
Mol. Mass.454.5337
SMILESCCOCCn1cc(C2CCN(CCOc3cccc(F)c3C(O)=O)CC2)c2ccccc12