Reaction Details
TargetKallikrein-1
LigandBDBM50157090
Substrate/Competitorn/a
Meas. Tech.ChEMBL_302558 (CHEMBL839521)
Ki 576±n/a nM
Citation Bruncko, MMcClellan, WJWendt, MDSauer, DRGeyer, ADalton, CRKaminski, MAWeitzberg, MGong, JDellaria, JFMantei, RZhao, XNienaber, VLStewart, KKlinghofer, VBouska, JRockway, TWGiranda, VL Naphthamidine urokinase plasminogen activator inhibitors with improved pharmacokinetic properties. Bioorg Med Chem Lett15:93-8 (2004) 
 
Kallikrein-1
Name:Kallikrein-1
Type:Enzyme
Mol. Mass.:28874.69
Organism:Homo sapiens (Human)
Description:P06870
Residue:262
BDBM50157090
NameBDBM50157090
Synonyms:6-(2-(1-isopropyl-2-methyl-1,2,3,4-tetrahydroisoquinolin-7-yl)cyclopropyl)-2-naphthimidamide CHEMBL185515
TypeSmall organic molecule
Emp. Form.C27H31N3
Mol. Mass.397.5551
SMILESCC(C)C1N(C)CCc2ccc(cc12)C1CC1c1ccc2cc(ccc2c1)C(N)=N