Reaction Details
TargetKallikrein-1
LigandBDBM50157092
Substrate/Competitorn/a
Meas. Tech.ChEMBL_302558 (CHEMBL839521)
Ki 206±n/a nM
Citation Bruncko, MMcClellan, WJWendt, MDSauer, DRGeyer, ADalton, CRKaminski, MAWeitzberg, MGong, JDellaria, JFMantei, RZhao, XNienaber, VLStewart, KKlinghofer, VBouska, JRockway, TWGiranda, VL Naphthamidine urokinase plasminogen activator inhibitors with improved pharmacokinetic properties. Bioorg Med Chem Lett15:93-8 (2004) 
 
Kallikrein-1
Name:Kallikrein-1
Type:Enzyme
Mol. Mass.:28874.69
Organism:Homo sapiens (Human)
Description:P06870
Residue:262
BDBM50157092
NameBDBM50157092
Synonyms:6-[2-(1-Cyclohexyl-3,4-dihydro-isoquinolin-7-yl)-cyclopropyl]-naphthalene-2-carboxamidine | CHEMBL182303
TypeSmall organic molecule
Emp. Form.C29H31N3
Mol. Mass.421.5765
SMILESNC(=N)c1ccc2cc(ccc2c1)C1CC1c1ccc2CCN=C(C3CCCCC3)c2c1