Reaction Details
TargetTrypsin
LigandBDBM50157085
Substrate/Competitorn/a
Meas. Tech.ChEMBL_302473 (CHEMBL826338)
Ki 720±n/a nM
Citation Bruncko, MMcClellan, WJWendt, MDSauer, DRGeyer, ADalton, CRKaminski, MAWeitzberg, MGong, JDellaria, JFMantei, RZhao, XNienaber, VLStewart, KKlinghofer, VBouska, JRockway, TWGiranda, VL Naphthamidine urokinase plasminogen activator inhibitors with improved pharmacokinetic properties. Bioorg Med Chem Lett15:93-8 (2004) 
 
Trypsin
Name:Trypsin
Synonyms:TRYP_PIG
Type:PROTEIN
Mol. Mass.:24411.24
Organism:Sus scrofa
Description:ChEMBL_1450738
Residue:231
BDBM50157085
NameBDBM50157085
TypeSmall organic molecule
Emp. Form.C20H18N2
Mol. Mass.286.3703
SMILESNC(=N)c1ccc2cc(ccc2c1)C1CC1c1ccccc1