Reaction Details
TargetTrypsin
LigandBDBM50157097
Substrate/Competitorn/a
Meas. Tech.ChEMBL_302473 (CHEMBL826338)
Ki 165±n/a nM
Citation Bruncko, MMcClellan, WJWendt, MDSauer, DRGeyer, ADalton, CRKaminski, MAWeitzberg, MGong, JDellaria, JFMantei, RZhao, XNienaber, VLStewart, KKlinghofer, VBouska, JRockway, TWGiranda, VL Naphthamidine urokinase plasminogen activator inhibitors with improved pharmacokinetic properties. Bioorg Med Chem Lett15:93-8 (2004) 
 
Trypsin
Name:Trypsin
Synonyms:TRYP_PIG
Type:PROTEIN
Mol. Mass.:24411.24
Organism:Sus scrofa
Description:ChEMBL_1450738
Residue:231
BDBM50157097
NameBDBM50157097
TypeSmall organic molecule
Emp. Form.C29H25N3
Mol. Mass.415.5289
SMILESNC(=N)c1ccc2cc(ccc2c1)C1CC1c1ccc2CCN=C(c3ccccc3)c2c1