Reaction Details
TargetUrokinase-type plasminogen activator
LigandBDBM50157100
Substrate/Competitorn/a
Meas. Tech.ChEMBL_302922 (CHEMBL830381)
Ki 198±n/a nM
Citation Bruncko, MMcClellan, WJWendt, MDSauer, DRGeyer, ADalton, CRKaminski, MAWeitzberg, MGong, JDellaria, JFMantei, RZhao, XNienaber, VLStewart, KKlinghofer, VBouska, JRockway, TWGiranda, VL Naphthamidine urokinase plasminogen activator inhibitors with improved pharmacokinetic properties. Bioorg Med Chem Lett15:93-8 (2004) 
 
Urokinase-type plasminogen activator
Name:Urokinase-type plasminogen activator
Type:Enzyme
Mol. Mass.:48528.62
Organism:Homo sapiens (Human)
Description:P00749
Residue:431
BDBM50157100
NameBDBM50157100
Synonyms:8-Furan-3-yl-6-(2-phenyl-cyclopropyl)-naphthalene-2-carboxamidine | CHEMBL183613
TypeSmall organic molecule
Emp. Form.C24H20N2O
Mol. Mass.352.4284
SMILESNC(=N)c1ccc2cc(cc(-c3ccoc3)c2c1)C1CC1c1ccccc1