Reaction Details
TargetPlasminogen
LigandBDBM50157099
Substrate/Competitorn/a
Meas. Tech.ChEMBL_302472 (CHEMBL826337)
Ki 1015±n/a nM
Citation Bruncko, MMcClellan, WJWendt, MDSauer, DRGeyer, ADalton, CRKaminski, MAWeitzberg, MGong, JDellaria, JFMantei, RZhao, XNienaber, VLStewart, KKlinghofer, VBouska, JRockway, TWGiranda, VL Naphthamidine urokinase plasminogen activator inhibitors with improved pharmacokinetic properties. Bioorg Med Chem Lett15:93-8 (2004) 
 
Plasminogen
Name:Plasminogen
Type:Enzyme
Mol. Mass.:90579.18
Organism:Homo sapiens (Human)
Description:n/a
Residue:810
BDBM50157099
NameBDBM50157099
Synonyms:4-Bromo-6-carbamimidoyl-naphthalene-2-carboxylic acid phenylamide | CHEMBL182220
TypeSmall organic molecule
Emp. Form.C18H14BrN3O
Mol. Mass.368.227
SMILESNC(=N)c1ccc2cc(cc(Br)c2c1)C(=O)Nc1ccccc1