Reaction Details
TargetPlasminogen
LigandBDBM50157092
Substrate/Competitorn/a
Meas. Tech.ChEMBL_302472 (CHEMBL826337)
Ki 594.0±n/a nM
Citation Bruncko, MMcClellan, WJWendt, MDSauer, DRGeyer, ADalton, CRKaminski, MAWeitzberg, MGong, JDellaria, JFMantei, RZhao, XNienaber, VLStewart, KKlinghofer, VBouska, JRockway, TWGiranda, VL Naphthamidine urokinase plasminogen activator inhibitors with improved pharmacokinetic properties. Bioorg Med Chem Lett15:93-8 (2004) 
 
Plasminogen
Name:Plasminogen
Type:Enzyme
Mol. Mass.:90579.18
Organism:Homo sapiens (Human)
Description:n/a
Residue:810
BDBM50157092
NameBDBM50157092
Synonyms:6-[2-(1-Cyclohexyl-3,4-dihydro-isoquinolin-7-yl)-cyclopropyl]-naphthalene-2-carboxamidine | CHEMBL182303
TypeSmall organic molecule
Emp. Form.C29H31N3
Mol. Mass.421.5765
SMILESNC(=N)c1ccc2cc(ccc2c1)C1CC1c1ccc2CCN=C(C3CCCCC3)c2c1