Reaction Details
TargetUrokinase-type plasminogen activator
LigandBDBM50157103
Substrate/Competitorn/a
Meas. Tech.ChEMBL_302922 (CHEMBL830381)
Ki 293±n/a nM
Citation Bruncko, MMcClellan, WJWendt, MDSauer, DRGeyer, ADalton, CRKaminski, MAWeitzberg, MGong, JDellaria, JFMantei, RZhao, XNienaber, VLStewart, KKlinghofer, VBouska, JRockway, TWGiranda, VL Naphthamidine urokinase plasminogen activator inhibitors with improved pharmacokinetic properties. Bioorg Med Chem Lett15:93-8 (2004) 
 
Urokinase-type plasminogen activator
Name:Urokinase-type plasminogen activator
Type:Enzyme
Mol. Mass.:48528.62
Organism:Homo sapiens (Human)
Description:P00749
Residue:431
BDBM50157103
NameBDBM50157103
Synonyms:6-[2-(1,2-Dimethyl-1,2,3,4-tetrahydro-isoquinolin-7-yl)-cyclopropyl]-naphthalene-2-carboxamidine | CHEMBL362671
TypeSmall organic molecule
Emp. Form.C25H27N3
Mol. Mass.369.502
SMILESCC1N(C)CCc2ccc(cc12)C1CC1c1ccc2cc(ccc2c1)C(N)=N