Reaction Details
TargetTissue-type plasminogen activator
LigandBDBM50157099
Substrate/Competitorn/a
Meas. Tech.ChEMBL_302869 (CHEMBL876364)
Ki 5590±n/a nM
Citation Bruncko, MMcClellan, WJWendt, MDSauer, DRGeyer, ADalton, CRKaminski, MAWeitzberg, MGong, JDellaria, JFMantei, RZhao, XNienaber, VLStewart, KKlinghofer, VBouska, JRockway, TWGiranda, VL Naphthamidine urokinase plasminogen activator inhibitors with improved pharmacokinetic properties. Bioorg Med Chem Lett15:93-8 (2004) 
 
Tissue-type plasminogen activator
Name:Tissue-type plasminogen activator
Type:Enzyme
Mol. Mass.:62931.08
Organism:Homo sapiens (Human)
Description:n/a
Residue:562
BDBM50157099
NameBDBM50157099
Synonyms:4-Bromo-6-carbamimidoyl-naphthalene-2-carboxylic acid phenylamide | CHEMBL182220
TypeSmall organic molecule
Emp. Form.C18H14BrN3O
Mol. Mass.368.227
SMILESNC(=N)c1ccc2cc(cc(Br)c2c1)C(=O)Nc1ccccc1