Reaction Details
TargetTrypsin
LigandBDBM50157082
Substrate/Competitorn/a
Meas. Tech.ChEMBL_302473 (CHEMBL826338)
Ki 346±n/a nM
Citation Bruncko, MMcClellan, WJWendt, MDSauer, DRGeyer, ADalton, CRKaminski, MAWeitzberg, MGong, JDellaria, JFMantei, RZhao, XNienaber, VLStewart, KKlinghofer, VBouska, JRockway, TWGiranda, VL Naphthamidine urokinase plasminogen activator inhibitors with improved pharmacokinetic properties. Bioorg Med Chem Lett15:93-8 (2004) 
 
Trypsin
Name:Trypsin
Synonyms:TRYP_PIG
Type:PROTEIN
Mol. Mass.:24411.24
Organism:Sus scrofa
Description:ChEMBL_1450738
Residue:231
BDBM50157082
NameBDBM50157082
TypeSmall organic molecule
Emp. Form.C19H16N2
Mol. Mass.272.3437
SMILESNC(=N)c1ccc2cc(\C=C\c3ccccc3)ccc2c1