Reaction Details
TargetUrokinase-type plasminogen activator
LigandBDBM50157104
Substrate/Competitorn/a
Meas. Tech.ChEMBL_302922 (CHEMBL830381)
Ki 731±n/a nM
Citation Bruncko, MMcClellan, WJWendt, MDSauer, DRGeyer, ADalton, CRKaminski, MAWeitzberg, MGong, JDellaria, JFMantei, RZhao, XNienaber, VLStewart, KKlinghofer, VBouska, JRockway, TWGiranda, VL Naphthamidine urokinase plasminogen activator inhibitors with improved pharmacokinetic properties. Bioorg Med Chem Lett15:93-8 (2004) 
 
Urokinase-type plasminogen activator
Name:Urokinase-type plasminogen activator
Type:Enzyme
Mol. Mass.:48528.62
Organism:Homo sapiens (Human)
Description:P00749
Residue:431
BDBM50157104
NameBDBM50157104
Synonyms:8-Furan-3-yl-6-phenethyl-naphthalene-2-carboxamidine | CHEMBL182546
TypeSmall organic molecule
Emp. Form.C23H20N2O
Mol. Mass.340.4177
SMILESNC(=N)c1ccc2cc(CCc3ccccc3)cc(-c3ccoc3)c2c1