Reaction Details
TargetEstrogen receptor beta
LigandBDBM50157143
Substrate/Competitorn/a
Meas. Tech.ChEMBL_305959 (CHEMBL831972)
IC50 25±n/a nM
Citation Blizzard, TADininno, FMorgan, JDChen, HYWu, JYKim, SChan, WBirzin, ETYang, YTPai, LYFitzgerald, PMSharma, NLi, YZhang, ZHayes, ECDasilva, CATang, WRohrer, SPSchaeffer, JMHammond, ML Estrogen receptor ligands. Part 9: Dihydrobenzoxathiin SERAMs with alkyl substituted pyrrolidine side chains and linkers. Bioorg Med Chem Lett15:107-13 (2004) 
 
Estrogen receptor beta
Name:Estrogen receptor beta
Type:Protein
Mol. Mass.:59238.43
Organism:Homo sapiens (Human)
Description:Q92731
Residue:530
BDBM50157143
NameBDBM50157143
Synonyms:(2S,3R)-3-(4-Hydroxy-phenyl)-2-[4-((S)-2-pyrrolidin-1-yl-butoxy)-phenyl]-2,3-dihydro-benzo[1,4]oxathiin-6-ol | CHEMBL367350
TypeSmall organic molecule
Emp. Form.C28H31NO4S
Mol. Mass.477.615
SMILESCC[C@@H](COc1ccc(cc1)[C@@H]1Oc2ccc(O)cc2S[C@@H]1c1ccc(O)cc1)N1CCCC1