Reaction Details
TargetEstrogen receptor beta
LigandBDBM50157161
Substrate/Competitorn/a
Meas. Tech.ChEMBL_305959 (CHEMBL831972)
IC50 13±n/a nM
Citation Blizzard, TADininno, FMorgan, JDChen, HYWu, JYKim, SChan, WBirzin, ETYang, YTPai, LYFitzgerald, PMSharma, NLi, YZhang, ZHayes, ECDasilva, CATang, WRohrer, SPSchaeffer, JMHammond, ML Estrogen receptor ligands. Part 9: Dihydrobenzoxathiin SERAMs with alkyl substituted pyrrolidine side chains and linkers. Bioorg Med Chem Lett15:107-13 (2004) 
 
Estrogen receptor beta
Name:Estrogen receptor beta
Type:Protein
Mol. Mass.:59238.43
Organism:Homo sapiens (Human)
Description:Q92731
Residue:530
BDBM50157161
NameBDBM50157161
Synonyms:(2S,3R)-3-(4-Hydroxy-phenyl)-2-(4-{2-[3-((S)-isopropyl)-pyrrolidin-1-yl]-ethoxy}-phenyl)-2,3-dihydro-benzo[1,4]oxathiin-6-ol | CHEMBL361601
TypeSmall organic molecule
Emp. Form.C29H33NO4S
Mol. Mass.491.642
SMILESCC(C)[C@@H]1CCN(CCOc2ccc(cc2)[C@@H]2Oc3ccc(O)cc3S[C@@H]2c2ccc(O)cc2)C1