Reaction Details
TargetCysteine protease
LigandBDBM50157207
Substrate/Competitorn/a
Meas. Tech.ChEMBL_305932 (CHEMBL833479)
IC50 38±n/a nM
Citation Fujii, NMallari, JPHansell, EJMackey, ZDoyle, PZhou, YMGut, JRosenthal, PJMcKerrow, JHGuy, RK Discovery of potent thiosemicarbazone inhibitors of rhodesain and cruzain. Bioorg Med Chem Lett15:121-3 (2004) 
 
Cysteine protease
Name:Cysteine protease
Synonyms:Rhodesain
Type:PROTEIN
Mol. Mass.:48425.78
Organism:Trypanosoma brucei rhodesiense
Description:ChEMBL_619861
Residue:450
BDBM50157207
NameBDBM50157207
TypeSmall organic molecule
Emp. Form.C16H13Cl2N3S
Mol. Mass.350.266
SMILESNC(=S)NN=C(C=Cc1ccccc1)c1ccc(Cl)c(Cl)c1