Reaction Details
TargetCruzipain
LigandBDBM50114608
Substrate/Competitorn/a
Meas. Tech.ChEMBL_305484 (CHEMBL830275)
IC50 30±n/a nM
Citation Fujii, NMallari, JPHansell, EJMackey, ZDoyle, PZhou, YMGut, JRosenthal, PJMcKerrow, JHGuy, RK Discovery of potent thiosemicarbazone inhibitors of rhodesain and cruzain. Bioorg Med Chem Lett15:121-3 (2004) 
 
Cruzipain
Name:Cruzipain
Type:Protein
Mol. Mass.:49831.41
Organism:Trypanosoma cruzi
Description:P25779
Residue:467
BDBM50114608
NameBDBM50114608
Synonyms:(1E)-1-(3,4-dichlorophenyl)propan-1-one thiosemicarbazone | CHEMBL92099
TypeSmall organic molecule
Emp. Form.C10H11Cl2N3S
Mol. Mass.276.185
SMILESCCC(=NNC(N)=S)c1ccc(Cl)c(Cl)c1