Reaction Details
TargetGag-Pol polyprotein [489-587]
LigandBDBM50157217
Substrate/Competitorn/a
Meas. Tech.ChEMBL_305393 (CHEMBL833043)
IC50 50000±n/a nM
Citation Garino, CBihel, FPietrancosta, NLaras, YQuéléver, GWoo, IKlein, PBain, JBoucher, JLKraus, JL New 2-bromomethyl-8-substituted-benzo[c]chromen-6-ones. Synthesis and biological properties. Bioorg Med Chem Lett15:135-8 (2004) 
 
Gag-Pol polyprotein [489-587]
Name:Gag-Pol polyprotein [489-587]
Type:Enzyme Subunit
Mol. Mass.:10781.16
Organism:Human immunodeficiency virus type 1
Description:P04585[489-587]
Residue:99
BDBM50157217
NameBDBM50157217
Synonyms:2-Methyl-8-nitro-benzo[c]chromen-6-one | CHEMBL182831
TypeSmall organic molecule
Emp. Form.C14H9NO4
Mol. Mass.255.2256
SMILESCc1ccc2oc(=O)c3cc(ccc3c2c1)[N+]([O-])=O