Reaction Details
TargetEstrogen receptor
LigandBDBM50157493
Substrate/Competitorn/a
Meas. Tech.ChEMBL_429939 (CHEMBL916819)
IC50 93±n/a nM
Citation Steffan, RJMatelan, EAshwell, MAMoore, WJSolvibile, WRTrybulski, EChadwick, CCChippari, SKenney, TEckert, ABorges-Marcucci, LKeith, JCXu, ZMosyak, LHarnish, DC Synthesis and activity of substituted 4-(indazol-3-yl)phenols as pathway-selective estrogen receptor ligands useful in the treatment of rheumatoid arthritis. J Med Chem47:6435-8 (2004) 
 
Estrogen receptor
Name:Estrogen receptor
Type:Protein
Mol. Mass.:66230.44
Organism:Homo sapiens (Human)
Description:P03372
Residue:595
BDBM50157493
NameBDBM50157493
Synonyms:4-[1-allyl-7-(trifluoromethyl)-1H-indazol-3-yl]benzene-1,3-diol WAY-169916
TypeSmall organic molecule
Emp. Form.C17H13F3N2O2
Mol. Mass.334.2925
SMILESOc1ccc(-c2nn(CC=C)c3c(cccc23)C(F)(F)F)c(O)c1