Reaction Details
TargetEstrogen receptor
LigandBDBM50157487
Substrate/Competitorn/a
Meas. Tech.ChEMBL_429939 (CHEMBL916819)
IC50 62±n/a nM
Citation Steffan, RJMatelan, EAshwell, MAMoore, WJSolvibile, WRTrybulski, EChadwick, CCChippari, SKenney, TEckert, ABorges-Marcucci, LKeith, JCXu, ZMosyak, LHarnish, DC Synthesis and activity of substituted 4-(indazol-3-yl)phenols as pathway-selective estrogen receptor ligands useful in the treatment of rheumatoid arthritis. J Med Chem47:6435-8 (2004) 
 
Estrogen receptor
Name:Estrogen receptor
Type:Protein
Mol. Mass.:66230.44
Organism:Homo sapiens (Human)
Description:P03372
Residue:595
BDBM50157487
NameBDBM50157487
Synonyms:4-(6-hydroxy-1-propyl-1H-indazol-3-yl)benzene-1,3-diol | CHEMBL225514
TypeSmall organic molecule
Emp. Form.C16H16N2O3
Mol. Mass.284.3098
SMILESCCCn1nc(-c2ccc(O)cc2O)c2ccc(O)cc12