Reaction Details
TargetEstrogen receptor
LigandBDBM50157498
Substrate/Competitorn/a
Meas. Tech.ChEMBL_429939 (CHEMBL916819)
IC50 25±n/a nM
Citation Steffan, RJMatelan, EAshwell, MAMoore, WJSolvibile, WRTrybulski, EChadwick, CCChippari, SKenney, TEckert, ABorges-Marcucci, LKeith, JCXu, ZMosyak, LHarnish, DC Synthesis and activity of substituted 4-(indazol-3-yl)phenols as pathway-selective estrogen receptor ligands useful in the treatment of rheumatoid arthritis. J Med Chem47:6435-8 (2004) 
 
Estrogen receptor
Name:Estrogen receptor
Type:Protein
Mol. Mass.:66230.44
Organism:Homo sapiens (Human)
Description:P03372
Residue:595
BDBM50157498
NameBDBM50157498
Synonyms:4-(1-butyl-7-chloro-1H-indazol-3-yl)phenol | CHEMBL385801
TypeSmall organic molecule
Emp. Form.C17H17ClN2O
Mol. Mass.300.783
SMILESCCCCn1nc(-c2ccc(O)cc2)c2cccc(Cl)c12