Reaction Details
TargetB1 bradykinin receptor
LigandBDBM50157511
Substrate/Competitorn/a
Meas. Tech.ChEMBL_429982 (CHEMBL917712)
Ki 3±n/a nM
Citation Kuduk, SDNg, CFeng, DMWai, JMChang, RSHarrell, CMMurphy, KLRansom, RWReiss, DIvarsson, MMason, GBoyce, STang, CPrueksaritanont, TFreidinger, RMPettibone, DJBock, MG 2,3-diaminopyridine bradykinin B1 receptor antagonists. J Med Chem47:6439-42 (2004) 
 
B1 bradykinin receptor
Name:B1 bradykinin receptor
Type:PROTEIN
Mol. Mass.:39519.62
Organism:Oryctolagus cuniculus
Description:ChEMBL_796432
Residue:352
BDBM50157511
NameBDBM50157511
Synonyms:CHEMBL387638 | N-(4-chloro-2-{(R)-1-[3'-fluoro-2'-(2-methyl-2H-tetrazol-5-yl)-biphenyl-4-yl]-ethylamino}-pyridin-3-yl)-2-cyano-acetamide
TypeSmall organic molecule
Emp. Form.C24H20ClFN8O
Mol. Mass.490.92
SMILESC[C@@H](Nc1nccc(Cl)c1NC(=O)CC#N)c1ccc(cc1)-c1cccc(F)c1-c1nnn(C)n1