Reaction Details
TargetDelta-type opioid receptor
LigandBDBM50157684
Substrate/Competitorn/a
Meas. Tech.ChEMBL_430079 (CHEMBL918101)
Ki 0.06±n/a nM
Citation Balboni, GSalvadori, SDal Piaz, ABortolotti, FArgazzi, RNegri, LLattanzi, RBryant, SDJinsmaa, YLazarus, LH Highly selective fluorescent analogue of the potent delta-opioid receptor antagonist Dmt-Tic. J Med Chem47:6541-6 (2004) 
 
Delta-type opioid receptor
Name:Delta-type opioid receptor
Type:G Protein-Coupled Receptor (GPCR)
Mol. Mass.:40465.04
Organism:Rattus norvegicus (rat)
Description:Competition binding assays were using CHO-K1 cell membranes expressing the opioid receptor.
Residue:372
BDBM50157684
NameBDBM50157684
Synonyms:CHEMBL2369958 | H-Dmt-Tic-Glu-NH2
TypeSmall organic molecule
Emp. Form.C26H32N4O6
Mol. Mass.496.5555
SMILESCc1cc(O)cc(C)c1C[C@H](N)C(=O)N1Cc2ccccc2C[C@H]1C(=O)N[C@@H](CCC(O)=O)C(N)=O