Reaction Details
TargetBeta-lactamase
LigandBDBM50157688
Substrate/Competitorn/a
Meas. Tech.ChEMBL_430086 (CHEMBL918107)
IC50 1±n/a nM
Citation Venkatesan, AMGu, YDos Santos, OAbe, TAgarwal, AYang, YPetersen, PJWeiss, WJMansour, TSNukaga, MHujer, AMBonomo, RAKnox, JR Structure-activity relationship of 6-methylidene penems bearing tricyclic heterocycles as broad-spectrum beta-lactamase inhibitors: crystallographic structures show unexpected binding of 1,4-thiazepine intermediates. J Med Chem47:6556-68 (2004) 
 
Beta-lactamase
Name:Beta-lactamase
Type:PROTEIN
Mol. Mass.:41306.67
Organism:Enterobacter cloacae
Description:ChEMBL_40258
Residue:381
BDBM50157688
NameBDBM50157688
Synonyms:(5R,6Z)-6-[(7-methylimidazo[2,1-b][1,3]-benzothiazol-2-ylmethylene)-7-oxo-4-thia-1-azabicyclo-[3.2.0]hept-2-ene-2-carboxylic acid sodium | CHEMBL222375
TypeSmall organic molecule
Emp. Form.C17H10N3NaO3S2
Mol. Mass.391.399
SMILESCc1ccc2c(c1)sc1nc(\C=C3/[C@H]4SC=C(N4C3=O)C(=O)O[Na])cn21