Reaction Details
TargetNeutrophil elastase
LigandBDBM50157704
Substrate/Competitorn/a
Meas. Tech.ChEMBL_430105 (CHEMBL919583)
IC50>75000±n/a nM
Citation Llinàs-Brunet, MBailey, MDGhiro, EGorys, VHalmos, TPoirier, MRancourt, JGoudreau, N A systematic approach to the optimization of substrate-based inhibitors of the hepatitis C virus NS3 protease: discovery of potent and specific tripeptide inhibitors. J Med Chem47:6584-94 (2004) 
 
Neutrophil elastase
Name:Neutrophil elastase
Type:Enzyme
Mol. Mass.:28532.38
Organism:Homo sapiens (Human)
Description:P08246
Residue:267
BDBM50157704
NameBDBM50157704
Synonyms:(1R,2S)-1-((3R,5S)-1-((S)-2-(tert-butoxycarbonyl)-3,3-dimethylbutanoyl)-3-(7-methoxy-2-phenylquinolin-4-yloxy)pyrrolidine-5-carboxamido)-2-vinylcyclopropanecarboxylic acid | CHEMBL222385
TypeSmall organic molecule
Emp. Form.C38H46N4O8
Mol. Mass.686.7938
SMILESCOc1ccc2c(O[C@@H]3C[C@H](N(C3)C(=O)[C@@H](NC(=O)OC(C)(C)C)C(C)(C)C)C(=O)N[C@@]3(C[C@H]3C=C)C(O)=O)cc(nc2c1)-c1ccccc1