Reaction Details
TargetAndrogen receptor
LigandBDBM35909
Substrate/Competitorn/a
Meas. Tech.ChEMBL_302725 (CHEMBL839595)
Ki 43±n/a nM
Citation Salvati, MEBalog, AShan, WWei, DDPickering, DAttar, RMGeng, JRizzo, CAGottardis, MMWeinmann, RKrystek, SRSack, JAn, YKish, K Structure based approach to the design of bicyclic-1H-isoindole-1,3(2H)-dione based androgen receptor antagonists. Bioorg Med Chem Lett15:271-6 (2004) 
 
Androgen receptor
Name:Androgen receptor
Type:Receptor
Mol. Mass.:99185.27
Organism:Homo sapiens (Human)
Description:CHO cells were stably transfected with human AR gene.
Residue:920
BDBM35909
NameBDBM35909
Synonyms:2-Hydroxy-2-methyl-N-(4-nitro-3-trifluoromethyl-phenyl)-propionamide 2-Hydroxy-2-methyl-N-(4-nitro-3-trifluoromethyl-phenyl)-propionamide(Hydroxyflutamide) CHEMBL491 Hydroxyflutamide Sch 16423 cid_91649 | hydroxy-flutamide
TypeSmall organic molecule
Emp. Form.C11H11F3N2O4
Mol. Mass.292.2112
SMILESCC(C)(O)C(=O)Nc1ccc(c(c1)C(F)(F)F)[N+]([O-])=O