Reaction Details
TargetAndrogen receptor
LigandBDBM50157824
Substrate/Competitorn/a
Meas. Tech.ChEMBL_302725 (CHEMBL839595)
Ki 3±n/a nM
Citation Salvati, MEBalog, AShan, WWei, DDPickering, DAttar, RMGeng, JRizzo, CAGottardis, MMWeinmann, RKrystek, SRSack, JAn, YKish, K Structure based approach to the design of bicyclic-1H-isoindole-1,3(2H)-dione based androgen receptor antagonists. Bioorg Med Chem Lett15:271-6 (2004) 
 
Androgen receptor
Name:Androgen receptor
Type:Receptor
Mol. Mass.:99185.27
Organism:Homo sapiens (Human)
Description:CHO cells were stably transfected with human AR gene.
Residue:920
BDBM50157824
NameBDBM50157824
Synonyms:(3a alpha,4beta,8beta,8a alpha)-4,5,6,7,8,8a-hexahydro-4,8-etheno-1H-cyclohepta[c]furan-1,3(3aH)-di-one | CHEMBL367375
TypeSmall organic molecule
Emp. Form.C21H16N2O4
Mol. Mass.360.3627
SMILESOc1c2C3C=CC([C@@H]4C[C@H]34)c2c(O)n1-c1ccc([N+]([O-])=O)c2ccccc12