Reaction Details
TargetAndrogen receptor
LigandBDBM50157826
Substrate/Competitorn/a
Meas. Tech.ChEMBL_317562 (CHEMBL825228)
Ki 0.5±n/a nM
Citation Salvati, MEBalog, AShan, WWei, DDPickering, DAttar, RMGeng, JRizzo, CAGottardis, MMWeinmann, RKrystek, SRSack, JAn, YKish, K Structure based approach to the design of bicyclic-1H-isoindole-1,3(2H)-dione based androgen receptor antagonists. Bioorg Med Chem Lett15:271-6 (2004) 
 
Androgen receptor
Name:Androgen receptor
Type:Receptor
Mol. Mass.:99185.27
Organism:Homo sapiens (Human)
Description:CHO cells were stably transfected with human AR gene.
Residue:920
BDBM50157826
NameBDBM50157826
Synonyms:(2S,6R)-4-(4-Nitro-naphthalen-1-yl)-4-aza-tricyclo[5.2.2.0*2,6*]undec-8-ene-3,5-dione | CHEMBL361445
TypeSmall organic molecule
Emp. Form.C20H16N2O4
Mol. Mass.348.352
SMILESOc1c2C3CCC(C=C3)c2c(O)n1-c1ccc([N+]([O-])=O)c2ccccc12