Reaction Details
TargetDNA excision repair protein ERCC-5
LigandBDBM50157837
Substrate/Competitorn/a
Meas. Tech.ChEMBL_305129 (CHEMBL832425)
IC50 0.215±n/a nM
Citation Tumey, LNBom, DHuck, BGleason, EWang, JSilver, DBrunden, KBoozer, SRundlett, SSherf, BMurphy, SDent, TLeventhal, CBailey, AHarrington, JBennani, YL The identification and optimization of a N-hydroxy urea series of flap endonuclease 1 inhibitors. Bioorg Med Chem Lett15:277-81 (2004) 
 
DNA excision repair protein ERCC-5
Name:DNA excision repair protein ERCC-5
Type:PROTEIN
Mol. Mass.:133069.11
Organism:Homo sapiens (Human)
Description:ChEMBL_305129
Residue:1186
BDBM50157837
NameBDBM50157837
Synonyms:3-Hydroxy-7-(3-methoxy-phenyl)-1H-furo[3,2-d]pyrimidine-2,4-dione | CHEMBL185325
TypeSmall organic molecule
Emp. Form.C13H10N2O5
Mol. Mass.274.2289
SMILESCOc1cccc(c1)-c1coc2c1[nH]c(=O)n(O)c2=O