Reaction Details
TargetFlap endonuclease 1
LigandBDBM50157839
Substrate/Competitorn/a
Meas. Tech.ChEMBL_304960 (CHEMBL827838)
IC50 0.035±n/a nM
Citation Tumey, LNBom, DHuck, BGleason, EWang, JSilver, DBrunden, KBoozer, SRundlett, SSherf, BMurphy, SDent, TLeventhal, CBailey, AHarrington, JBennani, YL The identification and optimization of a N-hydroxy urea series of flap endonuclease 1 inhibitors. Bioorg Med Chem Lett15:277-81 (2004) 
 
Flap endonuclease 1
Name:Flap endonuclease 1
Type:PROTEIN
Mol. Mass.:42602.57
Organism:Homo sapiens (Human)
Description:ChEMBL_1517026
Residue:380
BDBM50157839
NameBDBM50157839
Synonyms:3-Hydroxy-1-(4-methoxy-phenyl)-5-methyl-1H-thieno[2,3-d]pyrimidine-2,4-dione | CHEMBL362205
TypeSmall organic molecule
Emp. Form.C14H12N2O4S
Mol. Mass.304.321
SMILESCOc1ccc(cc1)-n1c2scc(C)c2c(=O)n(O)c1=O