Reaction Details
TargetDNA excision repair protein ERCC-5
LigandBDBM50157840
Substrate/Competitorn/a
Meas. Tech.ChEMBL_305129 (CHEMBL832425)
IC50 0.292±n/a nM
Citation Tumey, LNBom, DHuck, BGleason, EWang, JSilver, DBrunden, KBoozer, SRundlett, SSherf, BMurphy, SDent, TLeventhal, CBailey, AHarrington, JBennani, YL The identification and optimization of a N-hydroxy urea series of flap endonuclease 1 inhibitors. Bioorg Med Chem Lett15:277-81 (2004) 
 
DNA excision repair protein ERCC-5
Name:DNA excision repair protein ERCC-5
Type:PROTEIN
Mol. Mass.:133069.11
Organism:Homo sapiens (Human)
Description:ChEMBL_305129
Residue:1186
BDBM50157840
NameBDBM50157840
Synonyms:1-((2,3-dihydrobenzo[b][1,4]dioxin-2-yl)methyl)-3-hydroxythieno[3,2-d]pyrimidine-2,4(1H,3H)-dione (1) CHEMBL361546
TypeSmall organic molecule
Emp. Form.C15H12N2O5S
Mol. Mass.332.331
SMILESOn1c(=O)n(CC2COc3ccccc3O2)c2ccsc2c1=O