Reaction Details
TargetDNA excision repair protein ERCC-5
LigandBDBM50157832
Substrate/Competitorn/a
Meas. Tech.ChEMBL_305129 (CHEMBL832425)
IC50 0.101±n/a nM
Citation Tumey, LNBom, DHuck, BGleason, EWang, JSilver, DBrunden, KBoozer, SRundlett, SSherf, BMurphy, SDent, TLeventhal, CBailey, AHarrington, JBennani, YL The identification and optimization of a N-hydroxy urea series of flap endonuclease 1 inhibitors. Bioorg Med Chem Lett15:277-81 (2004) 
 
DNA excision repair protein ERCC-5
Name:DNA excision repair protein ERCC-5
Type:PROTEIN
Mol. Mass.:133069.11
Organism:Homo sapiens (Human)
Description:ChEMBL_305129
Residue:1186
BDBM50157832
NameBDBM50157832
Synonyms:3-Hydroxy-4a,7a-dihydro-1H-thieno[2,3-d]pyrimidine-2,4-dione | CHEMBL361350
TypeSmall organic molecule
Emp. Form.C6H4N2O3S
Mol. Mass.184.173
SMILESOn1c(=O)[nH]c2sccc2c1=O