Reaction Details
TargetDNA excision repair protein ERCC-5
LigandBDBM50157831
Substrate/Competitorn/a
Meas. Tech.ChEMBL_305129 (CHEMBL832425)
IC50 0.062±n/a nM
Citation Tumey, LNBom, DHuck, BGleason, EWang, JSilver, DBrunden, KBoozer, SRundlett, SSherf, BMurphy, SDent, TLeventhal, CBailey, AHarrington, JBennani, YL The identification and optimization of a N-hydroxy urea series of flap endonuclease 1 inhibitors. Bioorg Med Chem Lett15:277-81 (2004) 
 
DNA excision repair protein ERCC-5
Name:DNA excision repair protein ERCC-5
Type:PROTEIN
Mol. Mass.:133069.11
Organism:Homo sapiens (Human)
Description:ChEMBL_305129
Residue:1186
BDBM50157831
NameBDBM50157831
Synonyms:3-Hydroxy-1H-benzo[4,5]thieno[3,2-d]pyrimidine-2,4-dione | CHEMBL359533
TypeSmall organic molecule
Emp. Form.C10H6N2O3S
Mol. Mass.234.231
SMILESOn1c(=O)[nH]c2c3ccccc3sc2c1=O