Reaction Details
TargetDNA excision repair protein ERCC-5
LigandBDBM50157844
Substrate/Competitorn/a
Meas. Tech.ChEMBL_305129 (CHEMBL832425)
IC50 3.99±n/a nM
Citation Tumey, LNBom, DHuck, BGleason, EWang, JSilver, DBrunden, KBoozer, SRundlett, SSherf, BMurphy, SDent, TLeventhal, CBailey, AHarrington, JBennani, YL The identification and optimization of a N-hydroxy urea series of flap endonuclease 1 inhibitors. Bioorg Med Chem Lett15:277-81 (2004) 
 
DNA excision repair protein ERCC-5
Name:DNA excision repair protein ERCC-5
Type:PROTEIN
Mol. Mass.:133069.11
Organism:Homo sapiens (Human)
Description:ChEMBL_305129
Residue:1186
BDBM50157844
NameBDBM50157844
Synonyms:3-Hydroxy-5-methyl-1-phenyl-1H-thieno[2,3-d]pyrimidine-2,4-dione | CHEMBL181709
TypeSmall organic molecule
Emp. Form.C14H12N2O3S
Mol. Mass.288.322
SMILESCc1csc2n(Cc3ccccc3)c(=O)n(O)c(=O)c12