Reaction Details
TargetDNA excision repair protein ERCC-5
LigandBDBM50157828
Substrate/Competitorn/a
Meas. Tech.ChEMBL_305129 (CHEMBL832425)
IC50 3.04±n/a nM
Citation Tumey, LNBom, DHuck, BGleason, EWang, JSilver, DBrunden, KBoozer, SRundlett, SSherf, BMurphy, SDent, TLeventhal, CBailey, AHarrington, JBennani, YL The identification and optimization of a N-hydroxy urea series of flap endonuclease 1 inhibitors. Bioorg Med Chem Lett15:277-81 (2004) 
 
DNA excision repair protein ERCC-5
Name:DNA excision repair protein ERCC-5
Type:PROTEIN
Mol. Mass.:133069.11
Organism:Homo sapiens (Human)
Description:ChEMBL_305129
Residue:1186
BDBM50157828
NameBDBM50157828
Synonyms:3-Hydroxy-1-(7-methoxy-benzo[1,3]dioxol-5-ylmethyl)-5-methyl-1H-thieno[2,3-d]pyrimidine-2,4-dione | CHEMBL182519
TypeSmall organic molecule
Emp. Form.C16H14N2O6S
Mol. Mass.362.357
SMILESCOc1cc(Cn2c3scc(C)c3c(=O)n(O)c2=O)cc2OCOc12